{"text_format":"1","workbook":"xlsx","n_sheets":13,"sheets":["Introduction","Experimental Data","Criteria for LLLt<= 0,010","Criteria for LLLt 0,010-0,022","Criteria for LLLt 0,022-0,040","Criteria for LLLt 0,040-0,070","Criteria for LLLt 0,070-0,110","Criteria for LLLt 0,110-0,170","Criteria for LLLt 0,170-0,250","Criteria for LLLt 0,250-0,350","Criteria for LLLt 0,350-0,550","Criteria for LLLt >0,550","Calculos"],"not_rendered":{"charts":0,"images":1,"macros":1,"external_links":0,"defined_names":12,"comments":1,"pivot_tables":0},"unopened":[],"bounds":{"document_bytes":16777216,"sheet_cells":100000,"rows_first":2000,"rows_last":500,"rows_between":2000,"halvings":0,"cell_chars":16384,"cell_head_chars":4096},"cells_cut":0,"cells_raw":0,"read":"whole","date_system":"1900"}

{"sheet":"Introduction","index":0,"n_rows":15,"n_cols":6,"rows_kept":15,"cut":false,"hidden":false,"merged":[]}
[]
[]
[]
[]
[]
[]
[]
[]
{"$rows_left_out":8}
{"sheet":"Experimental Data","index":1,"n_rows":39,"n_cols":14,"rows_kept":39,"cut":false,"hidden":false,"merged":[[21,4,22,5],[22,8,22,9],[22,10,22,11],[21,6,21,7],[21,8,21,9],[21,10,21,11],[22,6,22,7]]}
[]
[]
[]
[]
[]
[]
[]
[]
{"$rows_left_out":32}
{"sheet":"Criteria for LLLt<= 0,010","index":2,"n_rows":41,"n_cols":8,"rows_kept":41,"cut":false,"hidden":false,"merged":[[1,1,1,8]]}
[null,"Criteria for LLL theor. < 0,010"]
[null,"Calculation Parameters"]
[null,"Sample Code",{"$f":"IF(C6=\"\",\"\",IF('Experimental Data'!F16=\"\",\"\",'Experimental Data'!F16))","v":""},{"$f":"IF(C6=\"\",\"\",IF('Experimental Data'!G16=\"\",\"\",'Experimental Data'!G16))","v":""},{"$f":"IF(C6=\"\",\"\",IF('Experimental Data'!H16=\"\",\"\",'Experimental Data'!H16))","v":""},{"$f":"IF(C6=\"\",\"\",IF('Experimental Data'!I16=\"\",\"\",'Experimental Data'!I16))","v":""},{"$f":"IF(C6=\"\",\"\",IF('Experimental Data'!J16=\"\",\"\",'Experimental Data'!J16))","v":""},{"$f":"IF(C6=\"\",\"\",IF('Experimental Data'!K16=\"\",\"\",'Experimental Data'!K16))","v":""}]
[null,"Oil Category",{"$f":"IF(C3=\"\",\"\",IF('Experimental Data'!F17=\"\",\"\",'Experimental Data'!F17))","v":""},{"$f":"IF(C4=\"\",\"\",IF(C4=\"EV\",\"Virgin Edible Olive Oil\",IF(C4=\"L\",\"Lampant Olive Oil\",IF(C4=\"R\",\"Refined Olive Oil\"))))","v":""}]
[]
[null,"DECN42 =",{"$f":"IF('Experimental Data'!E27=\"\",\"\",IF(Calculos!D33<=0.01,Calculos!M58,\"\"))","v":""},{"$f":"IF('Experimental Data'!E27=\"\",\"\",IF(Calculos!D33<=0.01,IF(C4=\"EV\",0.2,IF(OR(C4=\"R\",C4=\"L\"),0.3,\"\")),\"\"))","v":""},{"$f":"IF(C6=\"\",\"\",IF(C6<=D6,\"Proceed to the Early Criterion\",\"Proceed to the Early Criterion\"))","v":""},null,{"$f":"IF(C6=\"\",\"\",IF(C6>D6,\"Warning, The DECN42 is too high\",\"\"))","v":""}]
[]
[null,"Early Criterion K1"]
{"$rows_left_out":34}
{"sheet":"Criteria for LLLt 0,010-0,022","index":3,"n_rows":47,"n_cols":8,"rows_kept":47,"cut":false,"hidden":false,"merged":[[1,1,1,8]]}
[null,"Criteria for LLL theor. 0,010 - 0,022"]
[null,"Calculation Parameters"]
[null,"Sample Code",{"$f":"IF(C6=\"\",\"\",IF('Experimental Data'!F16=\"\",\"\",'Experimental Data'!F16))","v":""},{"$f":"IF(C6=\"\",\"\",IF('Experimental Data'!G16=\"\",\"\",'Experimental Data'!G16))","v":""},{"$f":"IF(C6=\"\",\"\",IF('Experimental Data'!H16=\"\",\"\",'Experimental Data'!H16))","v":""},{"$f":"IF(C6=\"\",\"\",IF('Experimental Data'!I16=\"\",\"\",'Experimental Data'!I16))","v":""},{"$f":"IF(C6=\"\",\"\",IF('Experimental Data'!J16=\"\",\"\",'Experimental Data'!J16))","v":""},{"$f":"IF(C6=\"\",\"\",IF('Experimental Data'!K16=\"\",\"\",'Experimental Data'!K16))","v":""}]
[null,"Oil Category",{"$f":"IF(C3=\"\",\"\",IF('Experimental Data'!F17=\"\",\"\",'Experimental Data'!F17))","v":""},{"$f":"IF(C4=\"\",\"\",IF(C4=\"EV\",\"Virgin Edible Olive Oil\",IF(C4=\"L\",\"Lampant Olive Oil\",IF(C4=\"R\",\"Refined Olive Oil\"))))","v":""}]
[]
[null,"DECN42 =",{"$f":"IF('Experimental Data'!E27=\"\",\"\",IF(AND(Calculos!D33>0.01,Calculos!D33<=0.022),Calculos!M58,\"\"))","v":""},{"$f":"IF('Experimental Data'!E27=\"\",\"\",IF(AND(Calculos!D33>0.01,Calculos!D33<=0.022),IF(C4=\"EV\",0.2,IF(OR(C4=\"R\",C4=\"L\"),0.3,\"\")),\"\"))","v":""},{"$f":"IF(C6=\"\",\"\",IF(C6<=D6,\"Proceed to the Early Criterion\",\"Proceed to the Early Criterion\"))","v":""},null,{"$f":"IF(C6=\"\",\"\",IF(C6>D6,\"Warning, The DECN42 is too high\",\"\"))","v":""}]
[]
[null,"Early Criterion K1"]
{"$rows_left_out":40}
{"sheet":"Criteria for LLLt 0,022-0,040","index":4,"n_rows":58,"n_cols":8,"rows_kept":58,"cut":false,"hidden":false,"merged":[[1,1,1,8]]}
[null,"Criteria for LLL theor. 0,022 - 0,040"]
[null,"Calculation Parameters"]
[null,"Sample Code",{"$f":"IF(C6=\"\",\"\",IF('Experimental Data'!F16=\"\",\"\",'Experimental Data'!F16))","v":""},{"$f":"IF(C6=\"\",\"\",IF('Experimental Data'!G16=\"\",\"\",'Experimental Data'!G16))","v":""},{"$f":"IF(C6=\"\",\"\",IF('Experimental Data'!H16=\"\",\"\",'Experimental Data'!H16))","v":""},{"$f":"IF(C6=\"\",\"\",IF('Experimental Data'!I16=\"\",\"\",'Experimental Data'!I16))","v":""},{"$f":"IF(C6=\"\",\"\",IF('Experimental Data'!J16=\"\",\"\",'Experimental Data'!J16))","v":""},{"$f":"IF(C6=\"\",\"\",IF('Experimental Data'!K16=\"\",\"\",'Experimental Data'!K16))","v":""}]
[null,"Oil Category",{"$f":"IF(C3=\"\",\"\",IF('Experimental Data'!F17=\"\",\"\",'Experimental Data'!F17))","v":""},{"$f":"IF(C4=\"\",\"\",IF(C4=\"EV\",\"Virgin Edible Olive Oil\",IF(C4=\"L\",\"Lampant Olive Oil\",IF(C4=\"R\",\"Refined Olive Oil\"))))","v":""}]
[]
[null,"DECN42 =",{"$f":"IF('Experimental Data'!E27=\"\",\"\",IF(AND(Calculos!D33>0.022,Calculos!D33<=0.04),Calculos!M58,\"\"))","v":""},{"$f":"IF('Experimental Data'!E27=\"\",\"\",IF(AND(Calculos!D33>0.022,Calculos!D33<=0.04),IF(C4=\"EV\",0.2,IF(OR(C4=\"R\",C4=\"L\"),0.3,\"\")),\"\"))","v":""},{"$f":"IF(C6=\"\",\"\",IF(C6<=D6,\"Proceed to the Early Criterion\",\"Proceed to the Early Criterion\"))","v":""},null,{"$f":"IF(C6=\"\",\"\",IF(C6>D6,\"Warning, The DECN42 is too high\",\"\"))","v":""}]
[]
[null,"Early Criterion K1"]
{"$rows_left_out":51}
{"sheet":"Criteria for LLLt 0,040-0,070","index":5,"n_rows":83,"n_cols":8,"rows_kept":83,"cut":false,"hidden":false,"merged":[[1,1,1,8]]}
[null,"Criteria for LLL theor. 0,040 - 0,070"]
[null,"Calculation Parameters"]
[null,"Sample Code",{"$f":"IF(C6=\"\",\"\",IF('Experimental Data'!F16=\"\",\"\",'Experimental Data'!F16))","v":""},{"$f":"IF(C6=\"\",\"\",IF('Experimental Data'!G16=\"\",\"\",'Experimental Data'!G16))","v":""},{"$f":"IF(C6=\"\",\"\",IF('Experimental Data'!H16=\"\",\"\",'Experimental Data'!H16))","v":""},{"$f":"IF(C6=\"\",\"\",IF('Experimental Data'!I16=\"\",\"\",'Experimental Data'!I16))","v":""},{"$f":"IF(C6=\"\",\"\",IF('Experimental Data'!J16=\"\",\"\",'Experimental Data'!J16))","v":""},{"$f":"IF(C6=\"\",\"\",IF('Experimental Data'!K16=\"\",\"\",'Experimental Data'!K16))","v":""}]
[null,"Oil Category",{"$f":"IF(C3=\"\",\"\",IF('Experimental Data'!F17=\"\",\"\",'Experimental Data'!F17))","v":""},{"$f":"IF(C4=\"\",\"\",IF(C4=\"EV\",\"Virgin Edible Olive Oil\",IF(C4=\"L\",\"Lampant Olive Oil\",IF(C4=\"R\",\"Refined Olive Oil\"))))","v":""}]
[]
[null,"DECN42 =",{"$f":"IF('Experimental Data'!E27=\"\",\"\",IF(AND(Calculos!D33>0.04,Calculos!D33<=0.07),Calculos!M58,\"\"))","v":""},{"$f":"IF('Experimental Data'!E27=\"\",\"\",IF(AND(Calculos!D33>0.04,Calculos!D33<=0.07),IF(C4=\"EV\",0.2,IF(OR(C4=\"R\",C4=\"L\"),0.3,\"\")),\"\"))","v":""},{"$f":"IF(C6=\"\",\"\",IF(C6<=D6,\"Proceed to the Early Criterion\",\"Proceed to the Early Criterion\"))","v":""},null,{"$f":"IF(C6=\"\",\"\",IF(C6>D6,\"Warning, The DECN42 is too high\",\"\"))","v":""}]
[]
[null,"Early Criterion K1"]
{"$rows_left_out":76}
{"sheet":"Criteria for LLLt 0,070-0,110","index":6,"n_rows":85,"n_cols":8,"rows_kept":85,"cut":false,"hidden":false,"merged":[[1,1,1,8]]}
[null,"Criteria for LLL theor. 0,070 - 0,110"]
[null,"Calculation Parameters"]
[null,"Sample Code",{"$f":"IF(C6=\"\",\"\",IF('Experimental Data'!F16=\"\",\"\",'Experimental Data'!F16))","v":""},{"$f":"IF(C6=\"\",\"\",IF('Experimental Data'!G16=\"\",\"\",'Experimental Data'!G16))","v":""},{"$f":"IF(C6=\"\",\"\",IF('Experimental Data'!H16=\"\",\"\",'Experimental Data'!H16))","v":""},{"$f":"IF(C6=\"\",\"\",IF('Experimental Data'!I16=\"\",\"\",'Experimental Data'!I16))","v":""},{"$f":"IF(C6=\"\",\"\",IF('Experimental Data'!J16=\"\",\"\",'Experimental Data'!J16))","v":""},{"$f":"IF(C6=\"\",\"\",IF('Experimental Data'!K16=\"\",\"\",'Experimental Data'!K16))","v":""}]
[null,"Oil Category",{"$f":"IF(C3=\"\",\"\",IF('Experimental Data'!F17=\"\",\"\",'Experimental Data'!F17))","v":""},{"$f":"IF(C4=\"\",\"\",IF(C4=\"EV\",\"Virgin Edible Olive Oil\",IF(C4=\"L\",\"Lampant Olive Oil\",IF(C4=\"R\",\"Refined Olive Oil\"))))","v":""}]
[]
[null,"DECN42 =",{"$f":"IF('Experimental Data'!E27=\"\",\"\",IF(AND(Calculos!D33>0.07,Calculos!D33<=0.11),Calculos!M58,\"\"))","v":""},{"$f":"IF('Experimental Data'!E27=\"\",\"\",IF(AND(Calculos!D33>0.07,Calculos!D33<=0.11),IF(C4=\"EV\",0.2,IF(OR(C4=\"R\",C4=\"L\"),0.3,\"\")),\"\"))","v":""},{"$f":"IF(C6=\"\",\"\",IF(C6<=D6,\"Proceed to the Early Criterion\",\"Proceed to the Early Criterion\"))","v":""},null,{"$f":"IF(C6=\"\",\"\",IF(C6>D6,\"Warning, The DECN42 is too high\",\"\"))","v":""}]
[]
[null,"Early Criterion K1"]
{"$rows_left_out":78}
{"sheet":"Criteria for LLLt 0,110-0,170","index":7,"n_rows":87,"n_cols":8,"rows_kept":87,"cut":false,"hidden":false,"merged":[[1,1,1,8]]}
[null,"Criteria for LLL theor. 0,110 - 0,170"]
[null,"Calculation Parameters"]
[null,"Sample Code",{"$f":"IF(C6=\"\",\"\",IF('Experimental Data'!F16=\"\",\"\",'Experimental Data'!F16))","v":""},{"$f":"IF(C6=\"\",\"\",IF('Experimental Data'!G16=\"\",\"\",'Experimental Data'!G16))","v":""},{"$f":"IF(C6=\"\",\"\",IF('Experimental Data'!H16=\"\",\"\",'Experimental Data'!H16))","v":""},{"$f":"IF(C6=\"\",\"\",IF('Experimental Data'!I16=\"\",\"\",'Experimental Data'!I16))","v":""},{"$f":"IF(C6=\"\",\"\",IF('Experimental Data'!J16=\"\",\"\",'Experimental Data'!J16))","v":""},{"$f":"IF(C6=\"\",\"\",IF('Experimental Data'!K16=\"\",\"\",'Experimental Data'!K16))","v":""}]
[null,"Oil Category",{"$f":"IF(C3=\"\",\"\",IF('Experimental Data'!F17=\"\",\"\",'Experimental Data'!F17))","v":""},{"$f":"IF(C4=\"\",\"\",IF(C4=\"EV\",\"Virgin Edible Olive Oil\",IF(C4=\"L\",\"Lampant Olive Oil\",IF(C4=\"R\",\"Refined Olive Oil\"))))","v":""}]
[]
[null,"DECN42 =",{"$f":"IF('Experimental Data'!E27=\"\",\"\",IF(AND(Calculos!D33>0.11,Calculos!D33<=0.17),Calculos!M58,\"\"))","v":""},{"$f":"IF('Experimental Data'!E27=\"\",\"\",IF(AND(Calculos!D33>0.11,Calculos!D33<=0.17),IF(C4=\"EV\",0.2,IF(OR(C4=\"R\",C4=\"L\"),0.3,\"\")),\"\"))","v":""},{"$f":"IF(C6=\"\",\"\",IF(C6<=D6,\"Proceed to the Early Criterion\",\"Proceed to the Early Criterion\"))","v":""},null,{"$f":"IF(C6=\"\",\"\",IF(C6>D6,\"Warning, The DECN42 is too high\",\"\"))","v":""}]
[]
[null,"Early Criterion K1"]
{"$rows_left_out":80}
{"sheet":"Criteria for LLLt 0,170-0,250","index":8,"n_rows":84,"n_cols":8,"rows_kept":84,"cut":false,"hidden":false,"merged":[[1,1,1,8]]}
[null,"Criteria for LLL theor. 0,170- 0,250"]
[null,"Calculation Parameters"]
[null,"Sample Code",{"$f":"IF(C6=\"\",\"\",IF('Experimental Data'!F16=\"\",\"\",'Experimental Data'!F16))","v":""},{"$f":"IF(C6=\"\",\"\",IF('Experimental Data'!G16=\"\",\"\",'Experimental Data'!G16))","v":""},{"$f":"IF(C6=\"\",\"\",IF('Experimental Data'!H16=\"\",\"\",'Experimental Data'!H16))","v":""},{"$f":"IF(C6=\"\",\"\",IF('Experimental Data'!I16=\"\",\"\",'Experimental Data'!I16))","v":""},{"$f":"IF(C6=\"\",\"\",IF('Experimental Data'!J16=\"\",\"\",'Experimental Data'!J16))","v":""},{"$f":"IF(C6=\"\",\"\",IF('Experimental Data'!K16=\"\",\"\",'Experimental Data'!K16))","v":""}]
[null,"Oil Category",{"$f":"IF(C3=\"\",\"\",IF('Experimental Data'!F17=\"\",\"\",'Experimental Data'!F17))","v":""},{"$f":"IF(C4=\"\",\"\",IF(C4=\"EV\",\"Virgin Edible Olive Oil\",IF(C4=\"L\",\"Lampant Olive Oil\",IF(C4=\"R\",\"Refined Olive Oil\"))))","v":""}]
[]
[null,"DECN42 =",{"$f":"IF('Experimental Data'!E27=\"\",\"\",IF(AND(Calculos!D33>0.17,Calculos!D33<=0.25),Calculos!M58,\"\"))","v":""},{"$f":"IF('Experimental Data'!E27=\"\",\"\",IF(AND(Calculos!D33>0.17,Calculos!D33<=0.25),IF(C4=\"EV\",0.2,IF(OR(C4=\"R\",C4=\"L\"),0.3,\"\")),\"\"))","v":""},{"$f":"IF(C6=\"\",\"\",IF(C6<=D6,\"Proceed to the Early Criterion\",\"Proceed to the Early Criterion\"))","v":""},null,{"$f":"IF(C6=\"\",\"\",IF(C6>D6,\"Warning, The DECN42 is too high\",\"\"))","v":""}]
[]
[null,"Early Criterion K1"]
{"$rows_left_out":77}
{"sheet":"Criteria for LLLt 0,250-0,350","index":9,"n_rows":84,"n_cols":8,"rows_kept":84,"cut":false,"hidden":false,"merged":[[1,1,1,8]]}
[null,"Criteria for LLL theor. 0,25-0,35"]
[null,"Calculation Parameters"]
[null,"Sample Code",{"$f":"IF(C6=\"\",\"\",IF('Experimental Data'!F16=\"\",\"\",'Experimental Data'!F16))","v":""},{"$f":"IF(C6=\"\",\"\",IF('Experimental Data'!G16=\"\",\"\",'Experimental Data'!G16))","v":""},{"$f":"IF(C6=\"\",\"\",IF('Experimental Data'!H16=\"\",\"\",'Experimental Data'!H16))","v":""},{"$f":"IF(C6=\"\",\"\",IF('Experimental Data'!I16=\"\",\"\",'Experimental Data'!I16))","v":""},{"$f":"IF(C6=\"\",\"\",IF('Experimental Data'!J16=\"\",\"\",'Experimental Data'!J16))","v":""},{"$f":"IF(C6=\"\",\"\",IF('Experimental Data'!K16=\"\",\"\",'Experimental Data'!K16))","v":""}]
[null,"Oil Category",{"$f":"IF(C3=\"\",\"\",IF('Experimental Data'!F17=\"\",\"\",'Experimental Data'!F17))","v":""},{"$f":"IF(C4=\"\",\"\",IF(C4=\"EV\",\"Virgin Edible Olive Oil\",IF(C4=\"L\",\"Lampant Olive Oil\",IF(C4=\"R\",\"Refined Olive Oil\"))))","v":""}]
[]
[null,"DECN42 =",{"$f":"IF('Experimental Data'!E27=\"\",\"\",IF(AND(Calculos!D33>0.25,Calculos!D33<=0.35),Calculos!M58,\"\"))","v":""},{"$f":"IF('Experimental Data'!E27=\"\",\"\",IF(AND(Calculos!D33>0.25,Calculos!D33<=0.35),IF(C4=\"EV\",0.2,IF(OR(C4=\"R\",C4=\"L\"),0.3,\"\")),\"\"))","v":""},{"$f":"IF(C6=\"\",\"\",IF(C6<=D6,\"Proceed to the Criterion 1\",\"Proceed to the Criterion 1\"))","v":""},null,{"$f":"IF(C6=\"\",\"\",IF(C6>D6,\"Warning, The DECN42 is too high\",\"\"))","v":""}]
[]
[null,"Early Criterion K1"]
{"$rows_left_out":77}
{"sheet":"Criteria for LLLt 0,350-0,550","index":10,"n_rows":88,"n_cols":8,"rows_kept":88,"cut":false,"hidden":false,"merged":[[1,1,1,8]]}
[null,"Criteria for LLL theor. 0,35-0,55"]
[null,"Calculation Parameters"]
[null,"Sample Code",{"$f":"IF(C6=\"\",\"\",IF('Experimental Data'!F16=\"\",\"\",'Experimental Data'!F16))","v":""},{"$f":"IF(C6=\"\",\"\",IF('Experimental Data'!G16=\"\",\"\",'Experimental Data'!G16))","v":""},{"$f":"IF(C6=\"\",\"\",IF('Experimental Data'!H16=\"\",\"\",'Experimental Data'!H16))","v":""},{"$f":"IF(C6=\"\",\"\",IF('Experimental Data'!I16=\"\",\"\",'Experimental Data'!I16))","v":""},{"$f":"IF(C6=\"\",\"\",IF('Experimental Data'!J16=\"\",\"\",'Experimental Data'!J16))","v":""},{"$f":"IF(C6=\"\",\"\",IF('Experimental Data'!K16=\"\",\"\",'Experimental Data'!K16))","v":""}]
[null,"Oil Category",{"$f":"IF(C3=\"\",\"\",IF('Experimental Data'!F17=\"\",\"\",'Experimental Data'!F17))","v":""},{"$f":"IF(C4=\"\",\"\",IF(C4=\"EV\",\"Virgin Edible Olive Oil\",IF(C4=\"L\",\"Lampant Olive Oil\",IF(C4=\"R\",\"Refined Olive Oil\"))))","v":""}]
[]
[null,"DECN42 =",{"$f":"IF('Experimental Data'!E27=\"\",\"\",IF(AND(Calculos!D33>0.35,Calculos!D33<=0.55),Calculos!M58,\"\"))","v":""},{"$f":"IF('Experimental Data'!E27=\"\",\"\",IF(AND(Calculos!D33>0.35,Calculos!D33<=0.55),IF(C4=\"EV\",0.2,IF(OR(C4=\"R\",C4=\"L\"),0.3,\"\")),\"\"))","v":""},{"$f":"IF(C6=\"\",\"\",IF(C6<=D6,\"Proceed to the Criterion 1\",\"Proceed to the Criterion 1\"))","v":""},null,{"$f":"IF(C6=\"\",\"\",IF(C6>D6,\"Warning, The DECN42 is too high\",\"\"))","v":""}]
[]
[null,"Early Criterion K1"]
{"$rows_left_out":81}
{"sheet":"Criteria for LLLt >0,550","index":11,"n_rows":55,"n_cols":8,"rows_kept":55,"cut":false,"hidden":false,"merged":[[1,1,1,8]]}
[null,"Criteria for LLL theor. >0,55"]
[null,"Calculation Parameters"]
[null,"Sample Code",{"$f":"IF(C6=\"\",\"\",IF('Experimental Data'!F16=\"\",\"\",'Experimental Data'!F16))","v":""},{"$f":"IF(C6=\"\",\"\",IF('Experimental Data'!G16=\"\",\"\",'Experimental Data'!G16))","v":""},{"$f":"IF(C6=\"\",\"\",IF('Experimental Data'!H16=\"\",\"\",'Experimental Data'!H16))","v":""},{"$f":"IF(C6=\"\",\"\",IF('Experimental Data'!I16=\"\",\"\",'Experimental Data'!I16))","v":""},{"$f":"IF(C6=\"\",\"\",IF('Experimental Data'!J16=\"\",\"\",'Experimental Data'!J16))","v":""},{"$f":"IF(C6=\"\",\"\",IF('Experimental Data'!K16=\"\",\"\",'Experimental Data'!K16))","v":""}]
[null,"Oil Category",{"$f":"IF(C3=\"\",\"\",IF('Experimental Data'!F17=\"\",\"\",'Experimental Data'!F17))","v":""},{"$f":"IF(C4=\"\",\"\",IF(C4=\"EV\",\"Virgin Edible Olive Oil\",IF(C4=\"L\",\"Lampant Olive Oil\",IF(C4=\"R\",\"Refined Olive Oil\"))))","v":""}]
[]
[null,"DECN42 =",{"$f":"IF('Experimental Data'!E27=\"\",\"\",IF(Calculos!D33>0.55,Calculos!M58,\"\"))","v":""},{"$f":"IF('Experimental Data'!E27=\"\",\"\",IF(Calculos!D33>0.55,IF(C4=\"EV\",0.2,IF(OR(C4=\"R\",C4=\"L\"),0.3,\"\")),\"\"))","v":""},{"$f":"IF(C6=\"\",\"\",IF(C6<=D6,\"Proceed to the Early Criterion\",\"Proceed to the Early Criterion\"))","v":""},null,{"$f":"IF(C6=\"\",\"\",IF(C6>D6,\"Warning, The DECN42 is too high\",\"\"))","v":""}]
[]
[null,"Early Criterion K1"]
{"$rows_left_out":48}
{"sheet":"Calculos","index":12,"n_rows":189,"n_cols":15,"rows_kept":189,"cut":false,"hidden":true,"merged":[]}
["CALCULATION OF THEORETICAL TRIGLYCERIDE COMPOSITION (1,3-R-2-R)"]
["Sample Code:",{"$f":"'Experimental Data'!F16","v":0}]
["Fill in the yellow fields"]
["MW",256.39999999999998,284.5,254.4,282.5,280.39999999999998,278.39999999999998,312.5,310.5,340.6,"MW"]
["Area % (GLC)","Palmitic","Stearic","Palmitoleic","Oleic","Linoleic","Linolenic","Arachidic","Gondoic","Behenic","Sum"]
["FA-Comp. Corr.",{"$f":"(100*B7)/K7","v":{"$error":"#DIV/0!"}},{"$f":"(100*C7)/K7","v":{"$error":"#DIV/0!"}},{"$f":"(100*D7)/K7","v":{"$error":"#DIV/0!"}},{"$f":"(100*E7)/K7","v":{"$error":"#DIV/0!"}},{"$f":"(100*F7)/K7","v":{"$error":"#DIV/0!"}},{"$f":"(100*G7)/K7","v":{"$error":"#DIV/0!"}},{"$f":"(100*H7)/K7","v":{"$error":"#DIV/0!"}},{"$f":"(100*I7)/K7","v":{"$error":"#DIV/0!"}},{"$f":"(100*J7)/K7","v":{"$error":"#DIV/0!"}},{"$f":"ROUND(SUM(B6:I6),0)","v":{"$error":"#DIV/0!"}}]
["Input FA-Comp.",{"$f":"'Experimental Data'!F21","v":0},{"$f":"'Experimental Data'!G21","v":0},{"$f":"'Experimental Data'!H21","v":0},{"$f":"'Experimental Data'!I21","v":0},{"$f":"'Experimental Data'!J21","v":0},{"$f":"'Experimental Data'!K21","v":0},{"$f":"'Experimental Data'!L21","v":0},{"$f":"'Experimental Data'!M21","v":0},0,{"$f":"SUM($B$7:$J$7)","v":0}]
[{"$f":"IF(OR(K7<=98,K7>100.01),\"Warning! The sum of Fatty Acids is out of range\",\"\")","v":"Warning! The sum of Fatty Acids is out of range"}]
{"$rows_left_out":181}